[Orca-users] Installing Orca Snapshot version on Linux 64bit RHE3

csarid csarid at yahoo.com
Sun Jun 18 18:20:39 PDT 2006

  I am in the process of installing the Orca-Snapshot version and I was able to configure just fine.By way, the documentation in this version is much better. 
  The configure work correctly. However, the make is erroring out. Please note that I'm trying to configure and make on RedHat3 on a EMT64 intel Xeon running 64bit OS. 
  Following is the output from the make. the last 10 lines show the actual error:
  make[6]: Leaving directory `/tmp/orca/orca-snapshot-r528/packages/rrdtool-1.0.50'
if gcc -DHAVE_CONFIG_H -I. -I. -I../..  -I../../src -I../../gd1.3   -g -O2 -MT trytime.o -MD -MP -MF ".deps/tryti         me.Tpo" -c -o trytime.o trytime.c; \
then mv -f ".deps/trytime.Tpo" ".deps/trytime.Po"; else rm -f ".deps/trytime.Tpo"; exit 1; fi
/bin/sh ../../libtool --tag=CC --mode=link gcc  -g -O2   -o trytime  trytime.o ../../src/librrd.la -lm
mkdir .libs
gcc -g -O2 -o trytime trytime.o  ../../src/.libs/librrd.a -lm
make[5]: Leaving directory `/tmp/orca/orca-snapshot-r528/packages/rrdtool-1.0.50/contrib/trytime'
make[5]: Entering directory `/tmp/orca/orca-snapshot-r528/packages/rrdtool-1.0.50/contrib'
make[6]: Entering directory `/tmp/orca/orca-snapshot-r528/packages/rrdtool-1.0.50'
make[6]: Leaving directory `/tmp/orca/orca-snapshot-r528/packages/rrdtool-1.0.50'
make[5]: Nothing to be done for `all-am'.
make[5]: Leaving directory `/tmp/orca/orca-snapshot-r528/packages/rrdtool-1.0.50/contrib'
make[4]: Leaving directory `/tmp/orca/orca-snapshot-r528/packages/rrdtool-1.0.50/contrib'
Making all in tcl
make[4]: Entering directory `/tmp/orca/orca-snapshot-r528/packages/rrdtool-1.0.50/tcl'
make[5]: Entering directory `/tmp/orca/orca-snapshot-r528/packages/rrdtool-1.0.50'
make[5]: Leaving directory `/tmp/orca/orca-snapshot-r528/packages/rrdtool-1.0.50'
make[4]: Nothing to be done for `all'.
make[4]: Leaving directory `/tmp/orca/orca-snapshot-r528/packages/rrdtool-1.0.50/tcl'
make[4]: Entering directory `/tmp/orca/orca-snapshot-r528/packages/rrdtool-1.0.50'
test -r perl-piped/Makefile.PL.in \
  || ln -s ./perl-piped/Makefile.PL.in perl-piped/Makefile.PL.in
test -r perl-piped/RRDp.pm \
  || ln -s ./perl-piped/RRDp.pm perl-piped/RRDp.pm
cd perl-piped && /usr/bin/perl Makefile.PL
Checking if your kit is complete...
Looks good
Writing Makefile for RRDp
cd perl-piped && make
make[5]: Entering directory `/tmp/orca/orca-snapshot-r528/packages/rrdtool-1.0.50/perl-piped'
cp RRDp.pm blib/lib/RRDp.pm
Manifying blib/man3/RRDp.3pm
make[5]: Leaving directory `/tmp/orca/orca-snapshot-r528/packages/rrdtool-1.0.50/perl-piped'
test -r perl-shared/Makefile.PL.in \
  || ln -s ./perl-shared/Makefile.PL.in perl-shared/Makefile.PL.in
test -r perl-shared/RRDs.pm \
  || ln -s ./perl-shared/RRDs.pm perl-shared/RRDs.pm
test -r perl-shared/RRDs.xs \
  || ln -s ./perl-shared/RRDs.xs perl-shared/RRDs.xs
cd perl-shared && /usr/bin/perl Makefile.PL
Checking if your kit is complete...
Looks good
Writing Makefile for RRDs
cd perl-shared && make
make[5]: Entering directory `/tmp/orca/orca-snapshot-r528/packages/rrdtool-1.0.50/perl-shared'
cp RRDs.pm blib/lib/RRDs.pm
cp ntmake.pl blib/lib/ntmake.pl
/usr/bin/perl /usr/lib/perl5/5.8.0/ExtUtils/xsubpp  -typemap /usr/lib/perl5/5.8.0/ExtUtils/typemap  RRDs.xs > RRD         s.xsc && mv RRDs.xsc RRDs.c
gcc -c  -I.. -I../src -I../gd1.3 -D_REENTRANT -D_GNU_SOURCE -DTHREADS_HAVE_PIDS -DDEBUGGING -fno-strict-aliasing          -I/usr/local/include -D_LARGEFILE_SOURCE -D_FILE_OFFSET_BITS=64 -I/usr/include/gdbm -DHAVE_CONFIG_H -O2 -g -pipe            -DVERSION=\"1.000503\" -DXS_VERSION=\"1.000503\" -fPIC "-I/usr/lib64/perl5/5.8.0/x86_64-linux-thread-multi/CORE         "  -DPERLPATCHLEVEL=8 RRDs.c
Running Mkbootstrap for RRDs ()
chmod 644 RRDs.bs
rm -f blib/arch/auto/RRDs/RRDs.so
gcc  -shared RRDs.o -L../src/.libs/ -lrrd_private   -lm -o blib/arch/auto/RRDs/RRDs.so
/usr/bin/ld: ../src/.libs//librrd_private.a(parsetime.o): relocation R_X86_64_32 can not be used when making a sh         ared object; recompile with -fPIC
../src/.libs//librrd_private.a: could not read symbols: Bad value
collect2: ld returned 1 exit status
make[5]: *** [blib/arch/auto/RRDs/RRDs.so] Error 1
make[5]: Leaving directory `/tmp/orca/orca-snapshot-r528/packages/rrdtool-1.0.50/perl-shared'
make[4]: *** [perl_shared] Error 2
make[4]: Leaving directory `/tmp/orca/orca-snapshot-r528/packages/rrdtool-1.0.50'
make[3]: *** [all-recursive] Error 1
make[3]: Leaving directory `/tmp/orca/orca-snapshot-r528/packages/rrdtool-1.0.50'
make[2]: *** [all] Error 2
make[2]: Leaving directory `/tmp/orca/orca-snapshot-r528/packages/rrdtool-1.0.50'
make[1]: *** [make_rrdtool] Error 2
make[1]: Leaving directory `/tmp/orca/orca-snapshot-r528/packages'
make: *** [all] Error 1

  Would appreciate any help.

Yahoo! Sports Fantasy Football ’06 - Go with the leader. Start your league today! 
-------------- next part --------------
An HTML attachment was scrubbed...
URL: </pipermail/orca-users/attachments/20060618/7c72bef7/attachment.html>

More information about the Orca-users mailing list