[Orca-users] Problem with Storable in Orca installation

Rodolfo Bustamante rodolfo.bustamante at gmail.com
Fri Jul 16 10:12:47 PDT 2010

Finally i resolved several errors, but i have a last error, any help will be
# /orca/software/bin/orca -v /orca/software/etc/orcallator.cfg
Use of uninitialized value in subroutine entry at
/usr/local/lib/perl5/5.12.0/sun4-solaris/DynaLoader.pm line 223.
 object version 2.33 does not match bootstrap parameter %_ at
/usr/local/lib/perl5/5.12.0/sun4-solaris/DynaLoader.pm line 223.
Compilation failed in require at /orca/software/bin/orca line 65.
BEGIN failed--compilation aborted at /orca/software/bin/orca line 65.

I think the problem is in Storable module, because i cant compile correctly,

# cd Storable-2.15
# ls
ChangeLog    Makefile.PL  Storable.c   blib         pm_to_blib
MANIFEST     README       Storable.pm  core         ppport.h
Makefile     Storable.bs  Storable.xs  hints        t
# perl Makefile.PL
Writing Makefile for Storable
# make
Skip blib/lib/Storable.pm (unchanged)
gcc -B/usr/ccs/bin/ -c    -fno-strict-aliasing -pipe -I/usr/local/include
-DXS_VERSION=\"2.15\" -fPIC
"-I/usr/local/lib/perl5/5.12.0/sun4-solaris/CORE"   Storable.c
Storable.xs: In function `sv_type':
Storable.xs:3416: error: duplicate case value
Storable.xs:3408: error: previously used here
Storable.xs:3434: error: duplicate case value
Storable.xs:3429: error: previously used here
*** Error code 1
make: Fatal error: Command failed for target `Storable.o'

I really need help please, any help is good.
Thanks in advanced

Ing. Rodolfo Bustamante
rodolfo.bustamante at gmail.com
-------------- next part --------------
An HTML attachment was scrubbed...
URL: </pipermail/orca-users/attachments/20100716/274b59bc/attachment.html>

More information about the Orca-users mailing list