[Orca-users] Problem with Storable in Orca installation

Hudes, Dana hudesd at hra.nyc.gov
Tue Jul 20 15:21:17 PDT 2010

you certainly have a compilation issue which is beyond orca.
which perl are you using?
I recommend either you punt and use the supplied perl with Solaris (in which case you use Sun Studio to compile) or you go with the OpenCSW. The advantage is that you can get precompiled packages for perl modules and more. http://www.opencsw.org
I find it much better than sunfreeware.com

The sunfreeware.com perl is probably comipiled with gcc...but which one? perl -V tells all.
Also you should make sure your version of ExtUtils::XS is at the same or later release data as your copy of storable.
You might want to use the upgrade command of cpan

All this is getting way out of the scope of orca. The perlmonks community offers generic perl help.

From: orca-users-bounces+hudesd=hra.nyc.gov at orcaware.com [mailto:orca-users-bounces+hudesd=hra.nyc.gov at orcaware.com] On Behalf Of Rodolfo Bustamante
Sent: Friday, July 16, 2010 1:13 PM
To: orca-users at orcaware.com
Subject: [Orca-users] Problem with Storable in Orca installation

Finally i resolved several errors, but i have a last error, any help will be appreciate.
# /orca/software/bin/orca -v /orca/software/etc/orcallator.cfg
Use of uninitialized value in subroutine entry at /usr/local/lib/perl5/5.12.0/sun4-solaris/DynaLoader.pm line 223.
 object version 2.33 does not match bootstrap parameter %_ at /usr/local/lib/perl5/5.12.0/sun4-solaris/DynaLoader.pm line 223.
Compilation failed in require at /orca/software/bin/orca line 65.
BEGIN failed--compilation aborted at /orca/software/bin/orca line 65.

I think the problem is in Storable module, because i cant compile correctly,

# cd Storable-2.15
# ls
ChangeLog    Makefile.PL  Storable.c   blib         pm_to_blib
MANIFEST     README       Storable.pm  core         ppport.h
Makefile     Storable.bs  Storable.xs  hints        t
# perl Makefile.PL
Writing Makefile for Storable
# make
Skip blib/lib/Storable.pm (unchanged)
gcc -B/usr/ccs/bin/ -c    -fno-strict-aliasing -pipe -I/usr/local/include -D_LARGEFILE_SOURCE -D_FILE_OFFSET_BITS=64 -O    -DVERSION=\"2.15\"  -DXS_VERSION=\"2.15\" -fPIC "-I/usr/local/lib/perl5/5.12.0/sun4-solaris/CORE"   Storable.c
Storable.xs: In function `sv_type':
Storable.xs:3416: error: duplicate case value
Storable.xs:3408: error: previously used here
Storable.xs:3434: error: duplicate case value
Storable.xs:3429: error: previously used here
*** Error code 1
make: Fatal error: Command failed for target `Storable.o'

I really need help please, any help is good.
Thanks in advanced

Ing. Rodolfo Bustamante
rodolfo.bustamante at gmail.com<mailto:rodolfo.bustamante at gmail.com>
-------------- next part --------------
An HTML attachment was scrubbed...
URL: </pipermail/orca-users/attachments/20100720/9579fa96/attachment.html>

More information about the Orca-users mailing list